{"text_format":"1","workbook":"xlsx","n_sheets":4,"sheets":["LISTE DES TIREURS","FEUILLE D'INSCRIPTION","MODE D'EMPLOI","Tireurs"],"not_rendered":{"charts":0,"images":3,"macros":1,"external_links":0,"defined_names":3,"comments":0,"pivot_tables":0},"unopened":[],"bounds":{"document_bytes":16777216,"sheet_cells":100000,"rows_first":2000,"rows_last":500,"rows_between":2000,"halvings":0,"cell_chars":16384,"cell_head_chars":4096},"cells_cut":0,"cells_raw":0,"read":"whole","date_system":"1900"}

{"sheet":"LISTE DES TIREURS","index":0,"n_rows":252,"n_cols":11,"rows_kept":252,"cut":false,"hidden":false,"merged":[]}
[]
[null,"TIR INTER-USINES","ANNÉE",{"$f":"INDEX('LISTE DES TIREURS'!J$8:J$31,'LISTE DES TIREURS'!K8)","v":2022}]
[null,null,null,null,null,{"$f":"D2","v":2022}]
[]
[null,"LISTE DES TIREURS","TOUT EN MAJUSCULE"]
[]
[null,"NOM PRÉNOM","AN (1950)","ARME - WAFFE",null,null,"NOUVEAU NOM DE GROUPE"]
[null,null,null,null,null,null,null,null,null,2017,6]
[null,null,null,null,8,1,"INDIVIDUEL",null,null,2018]
[null,null,null,null,null,null,"BIFFE LMB",null,null,2019]
[null,null,null,null,1,null,"LA BERRA LMB",null,null,2020]
[null,null,null,null,null,null,"LA CHIA LMB",null,null,2021]
[null,null,null,null,"A",null,"LA DENT DE BROC LMB",null,null,2022]
[null,null,null,null,"B",null,"LA DENT DE LYS LMB",null,null,2023]
[null,null,null,null,"C",null,"LA DENT DU BURGO LMB",null,null,2024]
[null,null,null,null,null,null,"LA DENT DU CHAMOIS LMB",null,null,2025]
[null,null,null,null,null,null,"LA HOCHMATT LMB",null,null,2026]
[null,null,null,null,null,null,"LA VUDALLA LMB",null,null,2027]
[null,null,null,null,null,null,"LE COUSIMBERT LMB",null,null,2028]
[null,null,null,null,null,null,"LE KAISEREGG LMB",null,null,2029]
[null,null,null,null,null,null,"LE MOLESON LMB",null,null,2030]
[null,null,null,null,null,null,"LE VANIL CARRE LMB",null,null,2031]
[null,null,null,null,null,null,"LE VANIL DE L'ECRI LMB",null,null,2032]
[null,null,null,null,null,null,"LE VANIL NOIR LMB",null,null,2033]
[null,null,null,null,null,null,"LES GASTLOSEN LMB",null,null,2034]
[null,null,null,null,null,null,"LES MERLAS LMB",null,null,2035]
[null,null,null,null,null,null,"LES PORTES LMB",null,null,2036]
[null,null,null,null,null,null,"POINTE DE PARAY LMB",null,null,2037]
[null,null,null,null,null,null,"DENT DU CHAMOIS LMB",null,null,2038]
[null,null,null,null,null,null,null,null,null,2039]
[null,null,null,null,null,null,null,null,null,2040]
[]
[]
[]
[]
[]
[]
[]
[]
[]
{"$rows_left_out":213}
{"sheet":"FEUILLE D'INSCRIPTION","index":1,"n_rows":1035,"n_cols":24,"rows_kept":1035,"cut":false,"hidden":false,"merged":[[2,23,2,27],[10,0,11,0],[1,0,2,0],[1,1,2,1],[1,2,2,2],[1,3,2,3],[3,0,4,0],[3,1,4,1],[3,2,4,2],[3,3,4,3],[6,0,7,0],[6,1,7,1],[6,2,7,2],[6,3,7,3],[6,4,7,4],[5,1,5,2],[0,17,5,17],[0,14,1,16],[1,4,2,4],[3,4,4,4],[3,10,5,10],[3,12,5,12],[2,9,5,9],[4,14,4,16],[2,14,3,16]]}
["ANNEE - JAHR",null,null,null,"CATEGORIE","Entreprise",null,null,{"$f":"'LISTE DES TIREURS'!D2","v":2022},null,null,null,null,null,"Participation au tir",null,null,"Rouge =                      tireur à double",5]
[{"$f":"'LISTE DES TIREURS'!$D$2-59","v":1963},"à",{"$f":"'LISTE DES TIREURS'!$D$2-20","v":2002},"=","Elite             Dame","LIEBHERR MACHINES BULLE SA",null,null,null,null,null,null,null,null,null,null,null,null,null,null,null,null,null,"A envoyer à :"]
[null,null,null,null,null,"Catégorie :","A","Equipe",14," N° de groupe",null,null,null,null,"Teilnahme Schießen",null,null,null,null,null,null,null,null,"hubert.thiemard@tir-interusines.ch"]
[{"$f":"'LISTE DES TIREURS'!$D$2-69","v":1953},"à",{"$f":"'LISTE DES TIREURS'!$D$2-60","v":1962},"=","Vétéran      Dame Vétéran","Liste des tireurs",null,null,null,null," N° d'équipe",null," Catégorie 2"]
[null,null,null,null,null,"Nom prénom","Année nais.","Catégorie 1","Nom de groupe",null,null,"Entreprise - Firma",null,"Arme","Séance"]
["<",{"$f":"'LISTE DES TIREURS'!$D$2-70","v":1952},null,"=","Sénior Vétéran     ","Name Vorname","Geburtsjahr",null,"Gruppe",null,null,null,null,"Waffe","1e VE","2e SA","3e SA"]
[{"$f":"'LISTE DES TIREURS'!$D$2-19","v":2003},"à",{"$f":"'LISTE DES TIREURS'!$D$2-17","v":2005},"=","Junior             Junior Dame",{"$f":"INDEX('LISTE DES TIREURS'!B$74:B$244,'FEUILLE D''INSCRIPTION'!S7)","v":"BESIM DEMIRI"},{"$f":"INDEX('LISTE DES TIREURS'!C$74:C$244,'FEUILLE D''INSCRIPTION'!S7)","v":1981},{"$f":"INDEX('FEUILLE D''INSCRIPTION'!U$7:U$15,'FEUILLE D''INSCRIPTION'!T7)","v":"ELITE"},{"$f":"INDEX('LISTE DES TIREURS'!G$8:G$82,'FEUILLE D''INSCRIPTION'!V7)","v":"LE MOLESON LMB"},"L",{"$f":"IF(F7>0,$I$3,\"\")","v":14},{"$f":"IF(F7>0,$F$2,\"\")","v":"LIEBHERR MACHINES BULLE SA"},{"$f":"IF(F7>0,$G$3,\"\")","v":"A"},{"$f":"INDEX('LISTE DES TIREURS'!D$74:D$244,'FEUILLE D''INSCRIPTION'!S7)","v":"F90"},null,null,null,{"$f":"COUNTIFS($S$7:$S$181,S7)","v":1},14,2,null,14]
[null,null,null,null,null,{"$f":"INDEX('LISTE DES TIREURS'!B$74:B$244,'FEUILLE D''INSCRIPTION'!S8)","v":"CHALABI DAVID"},{"$f":"INDEX('LISTE DES TIREURS'!C$74:C$244,'FEUILLE D''INSCRIPTION'!S8)","v":1996},{"$f":"INDEX('FEUILLE D''INSCRIPTION'!U$7:U$15,'FEUILLE D''INSCRIPTION'!T8)","v":"VETERAN"},{"$f":"INDEX('LISTE DES TIREURS'!G$8:G$82,'FEUILLE D''INSCRIPTION'!V8)","v":"LE MOLESON LMB"},"L",{"$f":"IF(F8>0,$I$3,\"\")","v":14},{"$f":"IF(F8>0,$F$2,\"\")","v":"LIEBHERR MACHINES BULLE SA"},{"$f":"IF(F8>0,$G$3,\"\")","v":"A"},{"$f":"INDEX('LISTE DES TIREURS'!D$74:D$244,'FEUILLE D''INSCRIPTION'!S8)","v":"F90"},null,null,null,{"$f":"COUNTIFS($S$7:$S$181,S8)","v":1},18,3,"ELITE",14]
[{"$f":"'LISTE DES TIREURS'!$D$2-16","v":2006},"à",{"$f":"'LISTE DES TIREURS'!$D$2-10","v":2012},"=","Adolescent",{"$f":"INDEX('LISTE DES TIREURS'!B$74:B$244,'FEUILLE D''INSCRIPTION'!S9)","v":"CORBINELLI GIOVANNI"},{"$f":"INDEX('LISTE DES TIREURS'!C$74:C$244,'FEUILLE D''INSCRIPTION'!S9)","v":1978},{"$f":"INDEX('FEUILLE D''INSCRIPTION'!U$7:U$15,'FEUILLE D''INSCRIPTION'!T9)","v":"ELITE"},{"$f":"INDEX('LISTE DES TIREURS'!G$8:G$82,'FEUILLE D''INSCRIPTION'!V9)","v":"LE MOLESON LMB"},"M",14,"LIEBHERR MACHINES BULLE SA","A",{"$f":"INDEX('LISTE DES TIREURS'!D$74:D$244,'FEUILLE D''INSCRIPTION'!S9)","v":"F90"},null,null,null,1,22,2,"VETERAN",14]
[null,null,null,null,null,{"$f":"INDEX('LISTE DES TIREURS'!B$74:B$244,'FEUILLE D''INSCRIPTION'!S10)","v":"MARTINS MARQUES FILIPE"},{"$f":"INDEX('LISTE DES TIREURS'!C$74:C$244,'FEUILLE D''INSCRIPTION'!S10)","v":1986},{"$f":"INDEX('FEUILLE D''INSCRIPTION'!U$7:U$15,'FEUILLE D''INSCRIPTION'!T10)","v":"DAME VETERAN"},{"$f":"INDEX('LISTE DES TIREURS'!G$8:G$82,'FEUILLE D''INSCRIPTION'!V10)","v":"LE MOLESON LMB"},"XXL",14,"LIEBHERR MACHINES BULLE SA","A",{"$f":"INDEX('LISTE DES TIREURS'!D$74:D$244,'FEUILLE D''INSCRIPTION'!S10)","v":"F90"},null,null,null,1,65,6,"SENIOR VETERAN",14]
[null,null,null,null,null,{"$f":"INDEX('LISTE DES TIREURS'!B$74:B$244,'FEUILLE D''INSCRIPTION'!S11)","v":"MEIER MAXIMILIANO"},{"$f":"INDEX('LISTE DES TIREURS'!C$74:C$244,'FEUILLE D''INSCRIPTION'!S11)","v":1987},{"$f":"INDEX('FEUILLE D''INSCRIPTION'!U$7:U$15,'FEUILLE D''INSCRIPTION'!T11)","v":"ELITE"},{"$f":"INDEX('LISTE DES TIREURS'!G$8:G$82,'FEUILLE D''INSCRIPTION'!V11)","v":"LE MOLESON LMB"},"M",{"$f":"IF(F11>0,$I$3,\"\")","v":14},"LIEBHERR MACHINES BULLE SA","A",{"$f":"INDEX('LISTE DES TIREURS'!D$74:D$244,'FEUILLE D''INSCRIPTION'!S11)","v":"F90"},null,null,null,1,68,2,"DAME",14]
[null,null,null,null,null,null,null,null,null,null,null,null,null,null,null,null,null,null,null,null,"DAME VETERAN"]
[null,null,null,null,null,{"$f":"INDEX('LISTE DES TIREURS'!B$74:B$244,'FEUILLE D''INSCRIPTION'!S13)","v":"MASTROGUILIO GIUSEPPE"},{"$f":"INDEX('LISTE DES TIREURS'!C$74:C$244,'FEUILLE D''INSCRIPTION'!S13)","v":1995},{"$f":"INDEX('FEUILLE D''INSCRIPTION'!U$7:U$15,'FEUILLE D''INSCRIPTION'!T13)","v":"ELITE"},{"$f":"INDEX('LISTE DES TIREURS'!G$8:G$82,'FEUILLE D''INSCRIPTION'!V13)","v":"LA VUDALLA LMB"},"M",14,"LIEBHERR MACHINES BULLE SA","A",{"$f":"INDEX('LISTE DES TIREURS'!D$74:D$244,'FEUILLE D''INSCRIPTION'!S13)","v":"F90"},null,null,null,{"$f":"COUNTIFS($S$7:$S$181,S13)","v":1},67,2,"JUNIOR",11]
[null,null,null,null,null,{"$f":"INDEX('LISTE DES TIREURS'!B$74:B$244,'FEUILLE D''INSCRIPTION'!S14)","v":"ELISEEV OLEG"},{"$f":"INDEX('LISTE DES TIREURS'!C$74:C$244,'FEUILLE D''INSCRIPTION'!S14)","v":1984},{"$f":"INDEX('FEUILLE D''INSCRIPTION'!U$7:U$15,'FEUILLE D''INSCRIPTION'!T14)","v":"ELITE"},{"$f":"INDEX('LISTE DES TIREURS'!G$8:G$82,'FEUILLE D''INSCRIPTION'!V14)","v":"LA VUDALLA LMB"},"XXL",14,"LIEBHERR MACHINES BULLE SA","A",{"$f":"INDEX('LISTE DES TIREURS'!D$74:D$244,'FEUILLE D''INSCRIPTION'!S14)","v":"F90"},null,null,null,{"$f":"COUNTIFS($S$7:$S$181,S14)","v":1},35,2,"JUNIOR DAME",11]
[null,null,null,null,null,{"$f":"INDEX('LISTE DES TIREURS'!B$74:B$244,'FEUILLE D''INSCRIPTION'!S15)","v":"GALLAND STELMA"},{"$f":"INDEX('LISTE DES TIREURS'!C$74:C$244,'FEUILLE D''INSCRIPTION'!S15)","v":1986},{"$f":"INDEX('FEUILLE D''INSCRIPTION'!U$7:U$15,'FEUILLE D''INSCRIPTION'!T15)","v":"VETERAN"},{"$f":"INDEX('LISTE DES TIREURS'!G$8:G$82,'FEUILLE D''INSCRIPTION'!V15)","v":"LA VUDALLA LMB"},"L",14,"LIEBHERR MACHINES BULLE SA","A",{"$f":"INDEX('LISTE DES TIREURS'!D$74:D$244,'FEUILLE D''INSCRIPTION'!S15)","v":"F90"},null,null,null,{"$f":"COUNTIFS($S$7:$S$181,S15)","v":1},46,3,"ADOLESCENT",11]
[null,null,null,null,null,{"$f":"INDEX('LISTE DES TIREURS'!B$74:B$244,'FEUILLE D''INSCRIPTION'!S16)","v":"MARTIN JEAN-PIERRE"},{"$f":"INDEX('LISTE DES TIREURS'!C$74:C$244,'FEUILLE D''INSCRIPTION'!S16)","v":1969},{"$f":"INDEX('FEUILLE D''INSCRIPTION'!U$7:U$15,'FEUILLE D''INSCRIPTION'!T16)","v":"ELITE"},{"$f":"INDEX('LISTE DES TIREURS'!G$8:G$82,'FEUILLE D''INSCRIPTION'!V16)","v":"LA VUDALLA LMB"},"XL",14,"LIEBHERR MACHINES BULLE SA","A",{"$f":"INDEX('LISTE DES TIREURS'!D$74:D$244,'FEUILLE D''INSCRIPTION'!S16)","v":"F57 / M"},null,null,null,{"$f":"IF(S16<=1,\"\",COUNTIFS($S$7:$S$181,S16))","v":1},64,2,null,11]
[null,null,null,null,null,{"$f":"INDEX('LISTE DES TIREURS'!B$74:B$244,'FEUILLE D''INSCRIPTION'!S17)","v":"PICCAND VINCENT"},{"$f":"INDEX('LISTE DES TIREURS'!C$74:C$244,'FEUILLE D''INSCRIPTION'!S17)","v":2000},{"$f":"INDEX('FEUILLE D''INSCRIPTION'!U$7:U$15,'FEUILLE D''INSCRIPTION'!T17)","v":"ELITE"},{"$f":"INDEX('LISTE DES TIREURS'!G$8:G$82,'FEUILLE D''INSCRIPTION'!V17)","v":"LA VUDALLA LMB"},"XL",14,"LIEBHERR MACHINES BULLE SA","A",{"$f":"INDEX('LISTE DES TIREURS'!D$74:D$244,'FEUILLE D''INSCRIPTION'!S17)","v":"F90"},null,null,null,1,80,2,null,11]
[]
[null,null,null,null,null,{"$f":"INDEX('LISTE DES TIREURS'!B$74:B$244,'FEUILLE D''INSCRIPTION'!S19)","v":"FENELON ROBIN"},{"$f":"INDEX('LISTE DES TIREURS'!C$74:C$244,'FEUILLE D''INSCRIPTION'!S19)","v":1989},{"$f":"INDEX('FEUILLE D''INSCRIPTION'!U$7:U$15,'FEUILLE D''INSCRIPTION'!T19)","v":"ELITE"},{"$f":"INDEX('LISTE DES TIREURS'!G$8:G$82,'FEUILLE D''INSCRIPTION'!V19)","v":"LA BERRA LMB"},"XL",14,"LIEBHERR MACHINES BULLE SA","A",{"$f":"INDEX('LISTE DES TIREURS'!D$74:D$244,'FEUILLE D''INSCRIPTION'!S19)","v":"F90"},null,null,null,{"$f":"COUNTIFS($S$7:$S$181,S19)","v":1},37,2,null,4]
[null,null,null,null,null,{"$f":"INDEX('LISTE DES TIREURS'!B$74:B$244,'FEUILLE D''INSCRIPTION'!S20)","v":"VIDEIRA LUIS"},{"$f":"INDEX('LISTE DES TIREURS'!C$74:C$244,'FEUILLE D''INSCRIPTION'!S20)","v":1989},{"$f":"INDEX('FEUILLE D''INSCRIPTION'!U$7:U$15,'FEUILLE D''INSCRIPTION'!T20)","v":"ELITE"},{"$f":"INDEX('LISTE DES TIREURS'!G$8:G$82,'FEUILLE D''INSCRIPTION'!V20)","v":"LA BERRA LMB"},"L",14,"LIEBHERR MACHINES BULLE SA","A",{"$f":"INDEX('LISTE DES TIREURS'!D$74:D$244,'FEUILLE D''INSCRIPTION'!S20)","v":"F90"},null,null,null,{"$f":"COUNTIFS($S$7:$S$181,S20)","v":1},104,2,null,4]
[null,null,null,null,null,{"$f":"INDEX('LISTE DES TIREURS'!B$74:B$244,'FEUILLE D''INSCRIPTION'!S21)","v":"HENRY REGIS"},{"$f":"INDEX('LISTE DES TIREURS'!C$74:C$244,'FEUILLE D''INSCRIPTION'!S21)","v":1989},{"$f":"INDEX('FEUILLE D''INSCRIPTION'!U$7:U$15,'FEUILLE D''INSCRIPTION'!T21)","v":"DAME"},{"$f":"INDEX('LISTE DES TIREURS'!G$8:G$82,'FEUILLE D''INSCRIPTION'!V21)","v":"LA BERRA LMB"},"S",14,"LIEBHERR MACHINES BULLE SA","A",{"$f":"INDEX('LISTE DES TIREURS'!D$74:D$244,'FEUILLE D''INSCRIPTION'!S21)","v":"F90"},null,null,null,{"$f":"COUNTIFS($S$7:$S$181,S21)","v":1},52,5,null,4]
[null,null,null,null,null,{"$f":"INDEX('LISTE DES TIREURS'!B$74:B$244,'FEUILLE D''INSCRIPTION'!S22)","v":"MENOUD SEBASTIEN"},{"$f":"INDEX('LISTE DES TIREURS'!C$74:C$244,'FEUILLE D''INSCRIPTION'!S22)","v":1974},{"$f":"INDEX('FEUILLE D''INSCRIPTION'!U$7:U$15,'FEUILLE D''INSCRIPTION'!T22)","v":"DAME"},{"$f":"INDEX('LISTE DES TIREURS'!G$8:G$82,'FEUILLE D''INSCRIPTION'!V22)","v":"LA BERRA LMB"},"M",14,"LIEBHERR MACHINES BULLE SA","A",{"$f":"INDEX('LISTE DES TIREURS'!D$74:D$244,'FEUILLE D''INSCRIPTION'!S22)","v":"F57 / M"},null,null,null,{"$f":"IF(S22<=1,\"\",COUNTIFS($S$7:$S$181,S22))","v":1},70,5,null,4]
[null,null,null,null,null,{"$f":"INDEX('LISTE DES TIREURS'!B$74:B$244,'FEUILLE D''INSCRIPTION'!S23)","v":"PETITJEAN BRICE"},{"$f":"INDEX('LISTE DES TIREURS'!C$74:C$244,'FEUILLE D''INSCRIPTION'!S23)","v":1990},{"$f":"INDEX('FEUILLE D''INSCRIPTION'!U$7:U$15,'FEUILLE D''INSCRIPTION'!T23)","v":"DAME"},{"$f":"INDEX('LISTE DES TIREURS'!G$8:G$82,'FEUILLE D''INSCRIPTION'!V23)","v":"LA BERRA LMB"},"L",14,"LIEBHERR MACHINES BULLE SA","A",{"$f":"INDEX('LISTE DES TIREURS'!D$74:D$244,'FEUILLE D''INSCRIPTION'!S23)","v":"F90"},null,null,null,1,79,5,null,4]
[]
[null,null,null,null,null,{"$f":"INDEX('LISTE DES TIREURS'!B$74:B$244,'FEUILLE D''INSCRIPTION'!S25)","v":"HEINZL MICKAEL"},{"$f":"INDEX('LISTE DES TIREURS'!C$74:C$244,'FEUILLE D''INSCRIPTION'!S25)","v":1972},{"$f":"INDEX('FEUILLE D''INSCRIPTION'!U$7:U$15,'FEUILLE D''INSCRIPTION'!T25)","v":"ELITE"},{"$f":"INDEX('LISTE DES TIREURS'!G$8:G$82,'FEUILLE D''INSCRIPTION'!V25)","v":"BIFFE LMB"},"M",14,"LIEBHERR MACHINES BULLE SA","A",{"$f":"INDEX('LISTE DES TIREURS'!D$74:D$244,'FEUILLE D''INSCRIPTION'!S25)","v":"F90"},null,null,null,{"$f":"COUNTIFS($S$7:$S$181,S25)","v":1},51,2,null,3]
[null,null,null,null,null,{"$f":"INDEX('LISTE DES TIREURS'!B$74:B$244,'FEUILLE D''INSCRIPTION'!S26)","v":"GALLAND MAXIME"},{"$f":"INDEX('LISTE DES TIREURS'!C$74:C$244,'FEUILLE D''INSCRIPTION'!S26)","v":1987},{"$f":"INDEX('FEUILLE D''INSCRIPTION'!U$7:U$15,'FEUILLE D''INSCRIPTION'!T26)","v":"ELITE"},{"$f":"INDEX('LISTE DES TIREURS'!G$8:G$82,'FEUILLE D''INSCRIPTION'!V26)","v":"BIFFE LMB"},"XL",14,"LIEBHERR MACHINES BULLE SA","A",{"$f":"INDEX('LISTE DES TIREURS'!D$74:D$244,'FEUILLE D''INSCRIPTION'!S26)","v":"F57 / M"},null,null,null,{"$f":"COUNTIFS($S$7:$S$181,S26)","v":1},45,2,null,3]
[null,null,null,null,null,{"$f":"INDEX('LISTE DES TIREURS'!B$74:B$244,'FEUILLE D''INSCRIPTION'!S27)","v":"MENDES DE BESSA JOSE CARLOS"},{"$f":"INDEX('LISTE DES TIREURS'!C$74:C$244,'FEUILLE D''INSCRIPTION'!S27)","v":1993},{"$f":"INDEX('FEUILLE D''INSCRIPTION'!U$7:U$15,'FEUILLE D''INSCRIPTION'!T27)","v":"ELITE"},{"$f":"INDEX('LISTE DES TIREURS'!G$8:G$82,'FEUILLE D''INSCRIPTION'!V27)","v":"BIFFE LMB"},"L",14,"LIEBHERR MACHINES BULLE SA","A",{"$f":"INDEX('LISTE DES TIREURS'!D$74:D$244,'FEUILLE D''INSCRIPTION'!S27)","v":"F90"},null,null,null,{"$f":"COUNTIFS($S$7:$S$181,S27)","v":1},69,2,null,3]
[null,null,null,null,null,{"$f":"INDEX('LISTE DES TIREURS'!B$74:B$244,'FEUILLE D''INSCRIPTION'!S28)","v":"MASTROGUILIO ANTONIO"},{"$f":"INDEX('LISTE DES TIREURS'!C$74:C$244,'FEUILLE D''INSCRIPTION'!S28)","v":1993},{"$f":"INDEX('FEUILLE D''INSCRIPTION'!U$7:U$15,'FEUILLE D''INSCRIPTION'!T28)","v":"ELITE"},{"$f":"INDEX('LISTE DES TIREURS'!G$8:G$82,'FEUILLE D''INSCRIPTION'!V28)","v":"BIFFE LMB"},"M",14,"LIEBHERR MACHINES BULLE SA","A",{"$f":"INDEX('LISTE DES TIREURS'!D$74:D$244,'FEUILLE D''INSCRIPTION'!S28)","v":"F90"},null,null,null,{"$f":"IF(S28<=1,\"\",COUNTIFS($S$7:$S$181,S28))","v":1},66,2,null,3]
[null,null,null,null,null,{"$f":"INDEX('LISTE DES TIREURS'!B$74:B$244,'FEUILLE D''INSCRIPTION'!S29)","v":"WYSSMUELLER ALAIN"},{"$f":"INDEX('LISTE DES TIREURS'!C$74:C$244,'FEUILLE D''INSCRIPTION'!S29)","v":1992},{"$f":"INDEX('FEUILLE D''INSCRIPTION'!U$7:U$15,'FEUILLE D''INSCRIPTION'!T29)","v":"ELITE"},{"$f":"INDEX('LISTE DES TIREURS'!G$8:G$82,'FEUILLE D''INSCRIPTION'!V29)","v":"BIFFE LMB"},"L",14,"LIEBHERR MACHINES BULLE SA","A",{"$f":"INDEX('LISTE DES TIREURS'!D$74:D$244,'FEUILLE D''INSCRIPTION'!S29)","v":"F90"},null,null,null,1,111,2,null,3]
[]
[null,null,null,null,null,{"$f":"INDEX('LISTE DES TIREURS'!B$74:B$244,'FEUILLE D''INSCRIPTION'!S31)","v":"LARBI SAMUEL"},{"$f":"INDEX('LISTE DES TIREURS'!C$74:C$244,'FEUILLE D''INSCRIPTION'!S31)","v":1990},{"$f":"INDEX('FEUILLE D''INSCRIPTION'!U$7:U$15,'FEUILLE D''INSCRIPTION'!T31)","v":"ELITE"},{"$f":"INDEX('LISTE DES TIREURS'!G$8:G$82,'FEUILLE D''INSCRIPTION'!V31)","v":"LA CHIA LMB"},{"$f":"INDEX('LISTE DES TIREURS'!F$8:F$82,'FEUILLE D''INSCRIPTION'!V31)","v":0},14,"LIEBHERR MACHINES BULLE SA","A",{"$f":"INDEX('LISTE DES TIREURS'!D$74:D$244,'FEUILLE D''INSCRIPTION'!S31)","v":"F57 / M"},null,null,null,{"$f":"COUNTIFS($S$7:$S$181,S31)","v":1},59,2,null,5]
[null,null,null,null,null,{"$f":"INDEX('LISTE DES TIREURS'!B$74:B$244,'FEUILLE D''INSCRIPTION'!S32)","v":"BORCARD GILLES"},{"$f":"INDEX('LISTE DES TIREURS'!C$74:C$244,'FEUILLE D''INSCRIPTION'!S32)","v":0},{"$f":"INDEX('FEUILLE D''INSCRIPTION'!U$7:U$15,'FEUILLE D''INSCRIPTION'!T32)","v":"ELITE"},{"$f":"INDEX('LISTE DES TIREURS'!G$8:G$82,'FEUILLE D''INSCRIPTION'!V32)","v":"LA CHIA LMB"},"M",14,"LIEBHERR MACHINES BULLE SA","A",{"$f":"INDEX('LISTE DES TIREURS'!D$74:D$244,'FEUILLE D''INSCRIPTION'!S32)","v":"F90"},null,null,null,{"$f":"COUNTIFS($S$7:$S$181,S32)","v":1},17,2,null,5]
[null,null,null,null,null,{"$f":"INDEX('LISTE DES TIREURS'!B$74:B$244,'FEUILLE D''INSCRIPTION'!S33)","v":"DEFFERARD VALENTIN"},{"$f":"INDEX('LISTE DES TIREURS'!C$74:C$244,'FEUILLE D''INSCRIPTION'!S33)","v":1992},{"$f":"INDEX('FEUILLE D''INSCRIPTION'!U$7:U$15,'FEUILLE D''INSCRIPTION'!T33)","v":"ELITE"},{"$f":"INDEX('LISTE DES TIREURS'!G$8:G$82,'FEUILLE D''INSCRIPTION'!V33)","v":"LA CHIA LMB"},"L",14,"LIEBHERR MACHINES BULLE SA","A",{"$f":"INDEX('LISTE DES TIREURS'!D$74:D$244,'FEUILLE D''INSCRIPTION'!S33)","v":"F90"},null,null,null,{"$f":"COUNTIFS($S$7:$S$181,S33)","v":1},28,2,null,5]
[null,null,null,null,null,{"$f":"INDEX('LISTE DES TIREURS'!B$74:B$244,'FEUILLE D''INSCRIPTION'!S34)","v":"MORISSET ALEXANDRE"},{"$f":"INDEX('LISTE DES TIREURS'!C$74:C$244,'FEUILLE D''INSCRIPTION'!S34)","v":1974},{"$f":"INDEX('FEUILLE D''INSCRIPTION'!U$7:U$15,'FEUILLE D''INSCRIPTION'!T34)","v":"ELITE"},{"$f":"INDEX('LISTE DES TIREURS'!G$8:G$82,'FEUILLE D''INSCRIPTION'!V34)","v":"LA CHIA LMB"},"M",14,"LIEBHERR MACHINES BULLE SA","A",{"$f":"INDEX('LISTE DES TIREURS'!D$74:D$244,'FEUILLE D''INSCRIPTION'!S34)","v":"F90"},null,null,null,{"$f":"IF(S34<=1,\"\",COUNTIFS($S$7:$S$181,S34))","v":1},74,2,null,5]
[null,null,null,null,null,{"$f":"INDEX('LISTE DES TIREURS'!B$74:B$244,'FEUILLE D''INSCRIPTION'!S35)","v":"TOUCHEFEU THIBAUT"},{"$f":"INDEX('LISTE DES TIREURS'!C$74:C$244,'FEUILLE D''INSCRIPTION'!S35)","v":1986},{"$f":"INDEX('FEUILLE D''INSCRIPTION'!U$7:U$15,'FEUILLE D''INSCRIPTION'!T35)","v":"ELITE"},{"$f":"INDEX('LISTE DES TIREURS'!G$8:G$82,'FEUILLE D''INSCRIPTION'!V35)","v":"LA CHIA LMB"},{"$f":"INDEX('LISTE DES TIREURS'!F$8:F$82,'FEUILLE D''INSCRIPTION'!V35)","v":0},14,"LIEBHERR MACHINES BULLE SA","A",{"$f":"INDEX('LISTE DES TIREURS'!D$74:D$244,'FEUILLE D''INSCRIPTION'!S35)","v":"F90"},null,null,null,1,99,2,null,5]
[]
[null,null,null,null,null,{"$f":"INDEX('LISTE DES TIREURS'!B$74:B$244,'FEUILLE D''INSCRIPTION'!S37)","v":"AKROUT SAMIR"},{"$f":"INDEX('LISTE DES TIREURS'!C$74:C$244,'FEUILLE D''INSCRIPTION'!S37)","v":1974},{"$f":"INDEX('FEUILLE D''INSCRIPTION'!U$7:U$15,'FEUILLE D''INSCRIPTION'!T37)","v":"ELITE"},{"$f":"INDEX('LISTE DES TIREURS'!G$8:G$82,'FEUILLE D''INSCRIPTION'!V37)","v":"LE VANIL NOIR LMB"},"XL",14,"LIEBHERR MACHINES BULLE SA","A",{"$f":"INDEX('LISTE DES TIREURS'!D$74:D$244,'FEUILLE D''INSCRIPTION'!S37)","v":"F90"},null,null,null,{"$f":"COUNTIFS($S$7:$S$181,S37)","v":1},3,2,null,17]
[null,null,null,null,null,{"$f":"INDEX('LISTE DES TIREURS'!B$74:B$244,'FEUILLE D''INSCRIPTION'!S38)","v":"ALTINIER BENOIT"},{"$f":"INDEX('LISTE DES TIREURS'!C$74:C$244,'FEUILLE D''INSCRIPTION'!S38)","v":1983},{"$f":"INDEX('FEUILLE D''INSCRIPTION'!U$7:U$15,'FEUILLE D''INSCRIPTION'!T38)","v":"ELITE"},{"$f":"INDEX('LISTE DES TIREURS'!G$8:G$82,'FEUILLE D''INSCRIPTION'!V38)","v":"LE VANIL NOIR LMB"},"L",14,"LIEBHERR MACHINES BULLE SA","A",{"$f":"INDEX('LISTE DES TIREURS'!D$74:D$244,'FEUILLE D''INSCRIPTION'!S38)","v":"F90"},null,null,null,{"$f":"COUNTIFS($S$7:$S$181,S38)","v":1},4,2,null,17]
[null,null,null,null,null,{"$f":"INDEX('LISTE DES TIREURS'!B$74:B$244,'FEUILLE D''INSCRIPTION'!S39)","v":"ANDRE BENJAMIN"},{"$f":"INDEX('LISTE DES TIREURS'!C$74:C$244,'FEUILLE D''INSCRIPTION'!S39)","v":1988},{"$f":"INDEX('FEUILLE D''INSCRIPTION'!U$7:U$15,'FEUILLE D''INSCRIPTION'!T39)","v":"ELITE"},{"$f":"INDEX('LISTE DES TIREURS'!G$8:G$82,'FEUILLE D''INSCRIPTION'!V39)","v":"LE VANIL NOIR LMB"},"XL",14,"LIEBHERR MACHINES BULLE SA","A",{"$f":"INDEX('LISTE DES TIREURS'!D$74:D$244,'FEUILLE D''INSCRIPTION'!S39)","v":"F90"},null,null,null,{"$f":"COUNTIFS($S$7:$S$181,S39)","v":1},5,2,null,17]
[null,null,null,null,null,{"$f":"INDEX('LISTE DES TIREURS'!B$74:B$244,'FEUILLE D''INSCRIPTION'!S40)","v":"CHATAGNY GAETAN"},{"$f":"INDEX('LISTE DES TIREURS'!C$74:C$244,'FEUILLE D''INSCRIPTION'!S40)","v":1975},{"$f":"INDEX('FEUILLE D''INSCRIPTION'!U$7:U$15,'FEUILLE D''INSCRIPTION'!T40)","v":"ELITE"},{"$f":"INDEX('LISTE DES TIREURS'!G$8:G$82,'FEUILLE D''INSCRIPTION'!V40)","v":"LE VANIL NOIR LMB"},{"$f":"INDEX('LISTE DES TIREURS'!F$8:F$82,'FEUILLE D''INSCRIPTION'!V40)","v":0},14,"LIEBHERR MACHINES BULLE SA","A",{"$f":"INDEX('LISTE DES TIREURS'!D$74:D$244,'FEUILLE D''INSCRIPTION'!S40)","v":"F90"},null,null,null,{"$f":"IF(S40<=1,\"\",COUNTIFS($S$7:$S$181,S40))","v":1},20,2,null,17]
{"$rows_left_out":996}
{"sheet":"MODE D'EMPLOI","index":2,"n_rows":0,"n_cols":0,"rows_kept":0,"cut":false,"hidden":false,"merged":[]}

{"sheet":"Tireurs","index":3,"n_rows":134,"n_cols":12,"rows_kept":134,"cut":false,"hidden":false,"merged":[]}
["Nom","Prénom","Année","Calibre","Téléphone","Natel","Mail ou courrier","2017-08-23","2017-08-30","2017-09-01","seul"]
["Adam","Olivier",1993,5.6,"-","-","mail",null,null,null,null,{"$f":"SUM(H2:K2)","v":0}]
["Akcoeltekin","Namik",1979,5.6,"-","-","mail",null,null,null,null,0]
["Akrout","Samir",1974,5.6,"-","-","mail",null,null,null,null,0]
["Altinier","Benoit",1983,5.6,"-","-","mail",null,null,null,null,0]
["Ammann","Dora",1984,5.6,"-","-","mail",null,null,null,null,0]
["Arias","José",1971,5.6,"-","-","mail",null,null,null,null,0]
["Ascensao Nunes Andrade","Bruno Macel",1974,5.6,"-","-","courrier",null,null,null,null,0]
["Aslan","Yunus Emere",1996,5.6,"-","-","courrier",null,null,null,null,0]
["Auderset ","Gregory",1993,5.6,"-","-","mail",null,null,null,null,0]
["Baciu","Adrian",1955,5.6,"-","-","courrier",null,null,null,null,0]
["Barras","Valentin",1996,5.6,"-","-",null,null,null,null,null,0]
["Barth","Daniel",1962,5.6,"-","078 / 607 28 97",null,null,null,null,null,0]
["Basset ","Christian",1956,5.6,"-","-","courrier",null,null,null,null,0]
["Baudois","Julien",1985,5.6,"-","078 / 722 63 58","mail",null,null,null,null,0]
["Beaud","Claude",1957,5.6,"-","-","mail",null,null,null,null,0]
["Benoit ","Jean-Romain",1970,5.6,null,null,"mail",null,null,null,null,0]
["Berger","Jean-Philippe",1975,5.6,"-","-","mail",null,null,null,null,0]
["Blanc","Marcel",1956,5.6,"-","079 / 614 67 91","mail",null,null,null,null,0]
["Boichat","Michel",1952,5.6,"-","079 / 259 35 06","mail",null,null,null,null,0]
["Bonnet","Julien",1984,5.6,"-","-","mail",null,null,null,null,0]
["Boschung","Elias",1988,5.6,"-","-","mail",null,null,null,null,0]
["Brülhart","Matthieu",1985,5.6,"-","079 / 547 98 29","mail",null,null,null,null,0]
["Carrel","Johann",1980,5.6,"-","-","mail",null,null,null,null,0]
["Castro","Paulo",1974,5.6,"-","-","courrier",null,null,null,null,0]
["Cetinjanin","Daniel",1984,5.6,"-","078 / 620 43 16","mail",null,null,null,null,0]
["Chalabi","David",1986,5.6,null,null,"courrier",null,null,null,null,0]
["Colheo Moreira ","Helder Manuel",1986,5.6,null,null,"Courrier",null,null,null,null,0]
["Corboz","Gabriel",1986,5.6,"-","-","mail",null,null,null,null,0]
["Currat","Jean-Michel",1962,5.6,"-","079 / 408 55 45","mail",null,null,null,null,0]
["Dabouz Mohamed","Nazim",1982,5.6,"-","-","mail",null,null,null,null,0]
["Daniel","Yvon",null,5.6,"-","-",null,null,null,null,null,0]
["De Almeida","José",1973,5.6,"-","-",null,null,null,null,null,0]
["Delacombaz","Maude",1989,5.6,"-","079 / 791 16 86","mail",null,null,null,null,0]
["Delas ","Mathieu",1991,5.6,null,null,"mail",null,null,null,null,0]
["Dobroes Texeira","Nuno",1979,5.6,"-","-","courrier",null,null,null,null,0]
["Doughty Davis","Gregory",1957,5.6,null,null,"mail",null,null,null,null,0]
["Dubey","Vincent",1982,5.6,"-","076 / 433 53 51","courrier",null,null,null,null,0]
["Dupont","Michel",1969,5.6,"-","-","mail",null,null,null,null,0]
["Egger","Sylvain",1988,5.6,"-","-","mail",null,null,null,null,0]
{"$rows_left_out":94}