{"text_format":"1","workbook":"xlsx","n_sheets":3,"sheets":["LISTE DES TIREURS","FEUILLE D'INSCRIPTION","MODE D'EMPLOI"],"not_rendered":{"charts":0,"images":3,"macros":1,"external_links":0,"defined_names":2,"comments":0,"pivot_tables":0},"unopened":[],"bounds":{"document_bytes":16777216,"sheet_cells":100000,"rows_first":2000,"rows_last":500,"rows_between":2000,"halvings":0,"cell_chars":16384,"cell_head_chars":4096},"cells_cut":0,"cells_raw":0,"read":"whole","date_system":"1900"}

{"sheet":"LISTE DES TIREURS","index":0,"n_rows":202,"n_cols":11,"rows_kept":202,"cut":false,"hidden":false,"merged":[]}
[]
[null,"TIR INTER-USINES","ANNÉE",{"$f":"INDEX('LISTE DES TIREURS'!J$8:J$31,'LISTE DES TIREURS'!K8)","v":2023}]
[null,null,null,null,null,{"$f":"D2","v":2023}]
[]
[null,"LISTE DES TIREURS","TOUT EN MAJUSCULE"]
[]
[null,"NOM PRÉNOM","AN (1950)","ARME - WAFFE",null,null,"NOUVEAU NOM DE GROUPE"]
[null,null,null,null,null,null,null,null,null,2017,7]
[null,null,null,null,8,1,"INDIVIDUEL",null,null,2018]
[null,null,null,null,null,null,"MITES A BETON 1",null,null,2019]
[null,null,null,null,1,null,"MITES A BETON 2",null,null,2020]
[null,null,null,null,null,null,null,null,null,2021]
[null,null,null,null,"A",null,null,null,null,2022]
[null,null,null,null,"B",null,null,null,null,2023]
[null,null,null,null,"C",null,null,null,null,2024]
[null,null,null,null,null,null,null,null,null,2025]
[null,null,null,null,null,null,null,null,null,2026]
[null,null,null,null,null,null,null,null,null,2027]
[null,null,null,null,null,null,null,null,null,2028]
[null,null,null,null,null,null,null,null,null,2029]
[null,null,null,null,null,null,null,null,null,2030]
[null,null,null,null,null,null,null,null,null,2031]
[null,null,null,null,null,null,null,null,null,2032]
[null,null,null,null,null,null,null,null,null,2033]
[null,null,null,null,null,null,null,null,null,2034]
[null,null,null,null,null,null,null,null,null,2035]
[null,null,null,null,null,null,null,null,null,2036]
[null,null,null,null,null,null,null,null,null,2037]
[null,null,null,null,null,null,null,null,null,2038]
[null,null,null,null,null,null,null,null,null,2039]
[null,null,null,null,null,null,null,null,null,2040]
[]
[]
[]
[null,null,null,null,null,null,{"$f":"G76","v":0}]
[null,null,null,null,null,null,0]
[null,null,null,null,null,null,0]
[null,null,null,null,null,null,0]
[null,null,null,null,null,null," "]
[null,null,null,null,null,null," "]
{"$rows_left_out":163}
{"sheet":"FEUILLE D'INSCRIPTION","index":1,"n_rows":1035,"n_cols":24,"rows_kept":1035,"cut":false,"hidden":false,"merged":[[2,23,2,27],[10,0,11,0],[1,0,2,0],[1,1,2,1],[1,2,2,2],[1,3,2,3],[3,0,4,0],[3,1,4,1],[3,2,4,2],[3,3,4,3],[6,0,7,0],[6,1,7,1],[6,2,7,2],[6,3,7,3],[6,4,7,4],[5,1,5,2],[3,17,5,17],[0,14,1,16],[1,4,2,4],[3,4,4,4],[3,10,5,10],[3,12,5,12],[2,9,5,9],[4,14,4,16],[2,14,3,16]]}
["ANNEE - JAHR",null,null,null,"CATEGORIE","Entreprise",null,null,{"$f":"'LISTE DES TIREURS'!D2","v":2023},null,null,null,null,null,"Participation au tir",null,null,null,5]
[{"$f":"'LISTE DES TIREURS'!$D$2-59","v":1964},"à",{"$f":"'LISTE DES TIREURS'!$D$2-20","v":2003},"=","Elite             Dame","J.-C.S.SCIAGE SA",null,null,null,null,null,null,null,null,null,null,null,null,null,null,null,null,null,"A envoyer à :"]
[null,null,null,null,null,"Catégorie :","C","Equipe",73," N° de groupe",null,null,null,null,"Teilnahme Schießen",null,null,null,null,null,null,null,null,"hubert.thiemard@tir-interusines.ch"]
[{"$f":"'LISTE DES TIREURS'!$D$2-69","v":1954},"à",{"$f":"'LISTE DES TIREURS'!$D$2-60","v":1963},"=","Vétéran      Dame Vétéran","Liste des tireurs",null,null,null,null," N° d'équipe",null," Catégorie 2",null,null,null,null,"Tireur   à double"]
[null,null,null,null,null,"Nom prénom","Année nais.","Catégorie 1","Nom de groupe",null,null,"Entreprise - Firma",null,"Arme","Séance"]
["<",{"$f":"'LISTE DES TIREURS'!$D$2-70","v":1953},null,"=","Sénior Vétéran     ","Name Vorname","Geburtsjahr",null,"Gruppe",null,null,null,null,"Waffe","1e VE","2e SA","3e SA"]
[{"$f":"'LISTE DES TIREURS'!$D$2-19","v":2004},"à",{"$f":"'LISTE DES TIREURS'!$D$2-17","v":2006},"=","Junior             Junior Dame",{"$f":"INDEX('LISTE DES TIREURS'!B$74:B$194,'FEUILLE D''INSCRIPTION'!S7)","v":"SUDAN GERALDINE"},{"$f":"INDEX('LISTE DES TIREURS'!C$74:C$194,'FEUILLE D''INSCRIPTION'!S7)","v":1989},{"$f":"INDEX('FEUILLE D''INSCRIPTION'!U$7:U$15,'FEUILLE D''INSCRIPTION'!T7)","v":"DAME"},{"$f":"INDEX('LISTE DES TIREURS'!G$8:G$82,'FEUILLE D''INSCRIPTION'!V7)","v":"MITES A BETON 1"},{"$f":"INDEX('LISTE DES TIREURS'!F$8:F$82,'FEUILLE D''INSCRIPTION'!V7)","v":0},{"$f":"IF(F7>0,$I$3,\"\")","v":73},{"$f":"IF(F7>0,$F$2,\"\")","v":"J.-C.S.SCIAGE SA"},{"$f":"IF(F7>0,$G$3,\"\")","v":"C"},{"$f":"INDEX('LISTE DES TIREURS'!D$74:D$194,'FEUILLE D''INSCRIPTION'!S7)","v":"F90"},null,null,null,{"$f":"IF(S7=1,\"\",COUNTIFS($S$7:$S$181,S7))","v":1},6,5,null,3]
[null,null,null,null,null,{"$f":"INDEX('LISTE DES TIREURS'!B$74:B$194,'FEUILLE D''INSCRIPTION'!S8)","v":"SUDAN MURIELLE"},{"$f":"INDEX('LISTE DES TIREURS'!C$74:C$194,'FEUILLE D''INSCRIPTION'!S8)","v":1962},{"$f":"INDEX('FEUILLE D''INSCRIPTION'!U$7:U$15,'FEUILLE D''INSCRIPTION'!T8)","v":"ELITE"},{"$f":"INDEX('LISTE DES TIREURS'!G$8:G$82,'FEUILLE D''INSCRIPTION'!V8)","v":"MITES A BETON 1"},{"$f":"INDEX('LISTE DES TIREURS'!F$8:F$82,'FEUILLE D''INSCRIPTION'!V8)","v":0},{"$f":"IF(F8>0,$I$3,\"\")","v":73},{"$f":"IF(F8>0,$F$2,\"\")","v":"J.-C.S.SCIAGE SA"},{"$f":"IF(F8>0,$G$3,\"\")","v":"C"},{"$f":"INDEX('LISTE DES TIREURS'!D$74:D$194,'FEUILLE D''INSCRIPTION'!S8)","v":"F90"},null,null,null,1,8,2,"ELITE",3]
[{"$f":"'LISTE DES TIREURS'!$D$2-16","v":2007},"à",{"$f":"'LISTE DES TIREURS'!$D$2-10","v":2013},"=","Adolescent",{"$f":"INDEX('LISTE DES TIREURS'!B$74:B$194,'FEUILLE D''INSCRIPTION'!S9)","v":"SUDAN JEAN-CLAUDE"},{"$f":"INDEX('LISTE DES TIREURS'!C$74:C$194,'FEUILLE D''INSCRIPTION'!S9)","v":1959},{"$f":"INDEX('FEUILLE D''INSCRIPTION'!U$7:U$15,'FEUILLE D''INSCRIPTION'!T9)","v":"VETERAN"},{"$f":"INDEX('LISTE DES TIREURS'!G$8:G$82,'FEUILLE D''INSCRIPTION'!V9)","v":"MITES A BETON 1"},{"$f":"INDEX('LISTE DES TIREURS'!F$8:F$82,'FEUILLE D''INSCRIPTION'!V9)","v":0},73,"J.-C.S.SCIAGE SA","C",{"$f":"INDEX('LISTE DES TIREURS'!D$74:D$194,'FEUILLE D''INSCRIPTION'!S9)","v":"F57 / M"},null,null,null,{"$f":"IF(S9=1,\"\",COUNTIFS($S$7:$S$181,S9))","v":1},7,3,"VETERAN",3]
[null,null,null,null,null,{"$f":"INDEX('LISTE DES TIREURS'!B$74:B$194,'FEUILLE D''INSCRIPTION'!S10)","v":0},{"$f":"INDEX('LISTE DES TIREURS'!C$74:C$194,'FEUILLE D''INSCRIPTION'!S10)","v":0},{"$f":"INDEX('FEUILLE D''INSCRIPTION'!U$7:U$15,'FEUILLE D''INSCRIPTION'!T10)","v":"VETERAN"},{"$f":"INDEX('LISTE DES TIREURS'!G$8:G$82,'FEUILLE D''INSCRIPTION'!V10)","v":"MITES A BETON 1"},{"$f":"INDEX('LISTE DES TIREURS'!F$8:F$82,'FEUILLE D''INSCRIPTION'!V10)","v":0},"","","",{"$f":"INDEX('LISTE DES TIREURS'!D$74:D$194,'FEUILLE D''INSCRIPTION'!S10)","v":0},null,null,null,{"$f":"IF(S10=1,\"\",COUNTIFS($S$7:$S$181,S10))","v":1},13,3,"SENIOR VETERAN",3]
[null,null,null,null,null,{"$f":"INDEX('LISTE DES TIREURS'!B$74:B$194,'FEUILLE D''INSCRIPTION'!S11)","v":0},{"$f":"INDEX('LISTE DES TIREURS'!C$74:C$194,'FEUILLE D''INSCRIPTION'!S11)","v":0},{"$f":"INDEX('FEUILLE D''INSCRIPTION'!U$7:U$15,'FEUILLE D''INSCRIPTION'!T11)","v":"DAME"},{"$f":"INDEX('LISTE DES TIREURS'!G$8:G$82,'FEUILLE D''INSCRIPTION'!V11)","v":"MITES A BETON 1"},{"$f":"INDEX('LISTE DES TIREURS'!F$8:F$82,'FEUILLE D''INSCRIPTION'!V11)","v":0},{"$f":"IF(F11>0,$I$3,\"\")","v":""},"","",{"$f":"INDEX('LISTE DES TIREURS'!D$74:D$194,'FEUILLE D''INSCRIPTION'!S11)","v":0},null,null,null,1,14,5,"DAME",3]
[null,null,null,null,null,null,null,null,null,null,null,null,null,null,null,null,null,null,null,null,"DAME VETERAN"]
[null,null,null,null,null,{"$f":"INDEX('LISTE DES TIREURS'!B$74:B$194,'FEUILLE D''INSCRIPTION'!S13)","v":"PIATEK MATEUSZ"},{"$f":"INDEX('LISTE DES TIREURS'!C$74:C$194,'FEUILLE D''INSCRIPTION'!S13)","v":1991},{"$f":"INDEX('FEUILLE D''INSCRIPTION'!U$7:U$15,'FEUILLE D''INSCRIPTION'!T13)","v":"ELITE"},{"$f":"INDEX('LISTE DES TIREURS'!G$8:G$82,'FEUILLE D''INSCRIPTION'!V13)","v":"MITES A BETON 2"},{"$f":"INDEX('LISTE DES TIREURS'!F$8:F$82,'FEUILLE D''INSCRIPTION'!V13)","v":0},73,"J.-C.S.SCIAGE SA","C",{"$f":"INDEX('LISTE DES TIREURS'!D$74:D$194,'FEUILLE D''INSCRIPTION'!S13)","v":"F57 / M"},null,null,null,{"$f":"IF(S13=1,\"\",COUNTIFS($S$7:$S$181,S13))","v":1},2,2,"JUNIOR",4]
[null,null,null,null,null,{"$f":"INDEX('LISTE DES TIREURS'!B$74:B$194,'FEUILLE D''INSCRIPTION'!S14)","v":"RIESEN YVAN"},{"$f":"INDEX('LISTE DES TIREURS'!C$74:C$194,'FEUILLE D''INSCRIPTION'!S14)","v":1989},{"$f":"INDEX('FEUILLE D''INSCRIPTION'!U$7:U$15,'FEUILLE D''INSCRIPTION'!T14)","v":"ELITE"},{"$f":"INDEX('LISTE DES TIREURS'!G$8:G$82,'FEUILLE D''INSCRIPTION'!V14)","v":"MITES A BETON 2"},{"$f":"INDEX('LISTE DES TIREURS'!F$8:F$82,'FEUILLE D''INSCRIPTION'!V14)","v":0},73,"J.-C.S.SCIAGE SA","C",{"$f":"INDEX('LISTE DES TIREURS'!D$74:D$194,'FEUILLE D''INSCRIPTION'!S14)","v":"F90"},null,null,null,1,4,2,"JUNIOR DAME",4]
[null,null,null,null,null,{"$f":"INDEX('LISTE DES TIREURS'!B$74:B$194,'FEUILLE D''INSCRIPTION'!S15)","v":"SUDAN ANGELIQUE"},{"$f":"INDEX('LISTE DES TIREURS'!C$74:C$194,'FEUILLE D''INSCRIPTION'!S15)","v":1983},{"$f":"INDEX('FEUILLE D''INSCRIPTION'!U$7:U$15,'FEUILLE D''INSCRIPTION'!T15)","v":"ELITE"},{"$f":"INDEX('LISTE DES TIREURS'!G$8:G$82,'FEUILLE D''INSCRIPTION'!V15)","v":"MITES A BETON 2"},{"$f":"INDEX('LISTE DES TIREURS'!F$8:F$82,'FEUILLE D''INSCRIPTION'!V15)","v":0},73,"J.-C.S.SCIAGE SA","C",{"$f":"INDEX('LISTE DES TIREURS'!D$74:D$194,'FEUILLE D''INSCRIPTION'!S15)","v":"F90"},null,null,null,{"$f":"IF(S15=1,\"\",COUNTIFS($S$7:$S$181,S15))","v":1},5,2,"ADOLESCENT",4]
[null,null,null,null,null,{"$f":"INDEX('LISTE DES TIREURS'!B$74:B$194,'FEUILLE D''INSCRIPTION'!S16)","v":"THEVENAZ NICOLAS"},{"$f":"INDEX('LISTE DES TIREURS'!C$74:C$194,'FEUILLE D''INSCRIPTION'!S16)","v":1989},{"$f":"INDEX('FEUILLE D''INSCRIPTION'!U$7:U$15,'FEUILLE D''INSCRIPTION'!T16)","v":"DAME"},{"$f":"INDEX('LISTE DES TIREURS'!G$8:G$82,'FEUILLE D''INSCRIPTION'!V16)","v":"MITES A BETON 2"},{"$f":"INDEX('LISTE DES TIREURS'!F$8:F$82,'FEUILLE D''INSCRIPTION'!V16)","v":0},73,"J.-C.S.SCIAGE SA","C",{"$f":"INDEX('LISTE DES TIREURS'!D$74:D$194,'FEUILLE D''INSCRIPTION'!S16)","v":"F90"},null,null,null,{"$f":"IF(S16=1,\"\",COUNTIFS($S$7:$S$181,S16))","v":1},9,5,null,4]
[null,null,null,null,null,{"$f":"INDEX('LISTE DES TIREURS'!B$74:B$194,'FEUILLE D''INSCRIPTION'!S17)","v":0},{"$f":"INDEX('LISTE DES TIREURS'!C$74:C$194,'FEUILLE D''INSCRIPTION'!S17)","v":0},{"$f":"INDEX('FEUILLE D''INSCRIPTION'!U$7:U$15,'FEUILLE D''INSCRIPTION'!T17)","v":"ELITE"},{"$f":"INDEX('LISTE DES TIREURS'!G$8:G$82,'FEUILLE D''INSCRIPTION'!V17)","v":"MITES A BETON 2"},{"$f":"INDEX('LISTE DES TIREURS'!F$8:F$82,'FEUILLE D''INSCRIPTION'!V17)","v":0},"","","",{"$f":"INDEX('LISTE DES TIREURS'!D$74:D$194,'FEUILLE D''INSCRIPTION'!S17)","v":0},null,null,null,1,10,2,null,4]
[]
[null,null,null,null,null,{"$f":"INDEX('LISTE DES TIREURS'!B$74:B$194,'FEUILLE D''INSCRIPTION'!S19)","v":"PIATEK PAWEL"},{"$f":"INDEX('LISTE DES TIREURS'!C$74:C$194,'FEUILLE D''INSCRIPTION'!S19)","v":1974},{"$f":"INDEX('FEUILLE D''INSCRIPTION'!U$7:U$15,'FEUILLE D''INSCRIPTION'!T19)","v":"ELITE"},{"$f":"INDEX('LISTE DES TIREURS'!G$8:G$82,'FEUILLE D''INSCRIPTION'!V19)","v":"INDIVIDUEL"},{"$f":"INDEX('LISTE DES TIREURS'!F$8:F$82,'FEUILLE D''INSCRIPTION'!V19)","v":1},73,"J.-C.S.SCIAGE SA","C",{"$f":"INDEX('LISTE DES TIREURS'!D$74:D$194,'FEUILLE D''INSCRIPTION'!S19)","v":"F57 / M"},null,null,null,{"$f":"IF(S19=1,\"\",COUNTIFS($S$7:$S$181,S19))","v":1},3,2,null,2]
[null,null,null,null,null,{"$f":"INDEX('LISTE DES TIREURS'!B$74:B$194,'FEUILLE D''INSCRIPTION'!S20)","v":0},{"$f":"INDEX('LISTE DES TIREURS'!C$74:C$194,'FEUILLE D''INSCRIPTION'!S20)","v":0},{"$f":"INDEX('FEUILLE D''INSCRIPTION'!U$7:U$15,'FEUILLE D''INSCRIPTION'!T20)","v":"ELITE"},{"$f":"INDEX('LISTE DES TIREURS'!G$8:G$82,'FEUILLE D''INSCRIPTION'!V20)","v":"INDIVIDUEL"},{"$f":"INDEX('LISTE DES TIREURS'!F$8:F$82,'FEUILLE D''INSCRIPTION'!V20)","v":1},"","","",{"$f":"INDEX('LISTE DES TIREURS'!D$74:D$194,'FEUILLE D''INSCRIPTION'!S20)","v":0},null,null,null,1,11,2,null,2]
[null,null,null,null,null,{"$f":"INDEX('LISTE DES TIREURS'!B$74:B$194,'FEUILLE D''INSCRIPTION'!S21)","v":0},{"$f":"INDEX('LISTE DES TIREURS'!C$74:C$194,'FEUILLE D''INSCRIPTION'!S21)","v":0},{"$f":"INDEX('FEUILLE D''INSCRIPTION'!U$7:U$15,'FEUILLE D''INSCRIPTION'!T21)","v":"ELITE"},{"$f":"INDEX('LISTE DES TIREURS'!G$8:G$82,'FEUILLE D''INSCRIPTION'!V21)","v":"INDIVIDUEL"},{"$f":"INDEX('LISTE DES TIREURS'!F$8:F$82,'FEUILLE D''INSCRIPTION'!V21)","v":1},"","","",{"$f":"INDEX('LISTE DES TIREURS'!D$74:D$194,'FEUILLE D''INSCRIPTION'!S21)","v":0},null,null,null,{"$f":"IF(S21=1,\"\",COUNTIFS($S$7:$S$181,S21))","v":1},15,2,null,2]
[null,null,null,null,null,{"$f":"INDEX('LISTE DES TIREURS'!B$74:B$194,'FEUILLE D''INSCRIPTION'!S22)","v":0},{"$f":"INDEX('LISTE DES TIREURS'!C$74:C$194,'FEUILLE D''INSCRIPTION'!S22)","v":0},{"$f":"INDEX('FEUILLE D''INSCRIPTION'!U$7:U$15,'FEUILLE D''INSCRIPTION'!T22)","v":"DAME"},{"$f":"INDEX('LISTE DES TIREURS'!G$8:G$82,'FEUILLE D''INSCRIPTION'!V22)","v":"INDIVIDUEL"},{"$f":"INDEX('LISTE DES TIREURS'!F$8:F$82,'FEUILLE D''INSCRIPTION'!V22)","v":1},"","","",{"$f":"INDEX('LISTE DES TIREURS'!D$74:D$194,'FEUILLE D''INSCRIPTION'!S22)","v":0},null,null,null,{"$f":"IF(S22=1,\"\",COUNTIFS($S$7:$S$181,S22))","v":1},12,5,null,2]
[null,null,null,null,null,{"$f":"INDEX('LISTE DES TIREURS'!B$74:B$194,'FEUILLE D''INSCRIPTION'!S23)","v":0},{"$f":"INDEX('LISTE DES TIREURS'!C$74:C$194,'FEUILLE D''INSCRIPTION'!S23)","v":0},{"$f":"INDEX('FEUILLE D''INSCRIPTION'!U$7:U$15,'FEUILLE D''INSCRIPTION'!T23)","v":0},{"$f":"INDEX('LISTE DES TIREURS'!G$8:G$82,'FEUILLE D''INSCRIPTION'!V23)","v":0},{"$f":"INDEX('LISTE DES TIREURS'!F$8:F$82,'FEUILLE D''INSCRIPTION'!V23)","v":0},"","","",{"$f":"INDEX('LISTE DES TIREURS'!D$74:D$194,'FEUILLE D''INSCRIPTION'!S23)","v":0},null,null,null,1,20,1,null,5]
[]
[null,null,null,null,null,{"$f":"INDEX('LISTE DES TIREURS'!B$74:B$194,'FEUILLE D''INSCRIPTION'!S25)","v":0},{"$f":"INDEX('LISTE DES TIREURS'!C$74:C$194,'FEUILLE D''INSCRIPTION'!S25)","v":0},{"$f":"INDEX('FEUILLE D''INSCRIPTION'!U$7:U$15,'FEUILLE D''INSCRIPTION'!T25)","v":0},{"$f":"INDEX('LISTE DES TIREURS'!G$8:G$82,'FEUILLE D''INSCRIPTION'!V25)","v":0},{"$f":"INDEX('LISTE DES TIREURS'!F$8:F$82,'FEUILLE D''INSCRIPTION'!V25)","v":0},"","","",{"$f":"INDEX('LISTE DES TIREURS'!D$74:D$194,'FEUILLE D''INSCRIPTION'!S25)","v":0},null,null,null,{"$f":"IF(S25=1,\"\",COUNTIFS($S$7:$S$181,S25))","v":""},1,1,null,6]
[null,null,null,null,null,{"$f":"INDEX('LISTE DES TIREURS'!B$74:B$194,'FEUILLE D''INSCRIPTION'!S26)","v":0},{"$f":"INDEX('LISTE DES TIREURS'!C$74:C$194,'FEUILLE D''INSCRIPTION'!S26)","v":0},{"$f":"INDEX('FEUILLE D''INSCRIPTION'!U$7:U$15,'FEUILLE D''INSCRIPTION'!T26)","v":0},{"$f":"INDEX('LISTE DES TIREURS'!G$8:G$82,'FEUILLE D''INSCRIPTION'!V26)","v":0},{"$f":"INDEX('LISTE DES TIREURS'!F$8:F$82,'FEUILLE D''INSCRIPTION'!V26)","v":0},"","","",{"$f":"INDEX('LISTE DES TIREURS'!D$74:D$194,'FEUILLE D''INSCRIPTION'!S26)","v":0},null,null,null,1,28,1,null,6]
[null,null,null,null,null,{"$f":"INDEX('LISTE DES TIREURS'!B$74:B$194,'FEUILLE D''INSCRIPTION'!S27)","v":0},{"$f":"INDEX('LISTE DES TIREURS'!C$74:C$194,'FEUILLE D''INSCRIPTION'!S27)","v":0},{"$f":"INDEX('FEUILLE D''INSCRIPTION'!U$7:U$15,'FEUILLE D''INSCRIPTION'!T27)","v":0},{"$f":"INDEX('LISTE DES TIREURS'!G$8:G$82,'FEUILLE D''INSCRIPTION'!V27)","v":0},{"$f":"INDEX('LISTE DES TIREURS'!F$8:F$82,'FEUILLE D''INSCRIPTION'!V27)","v":0},"","","",{"$f":"INDEX('LISTE DES TIREURS'!D$74:D$194,'FEUILLE D''INSCRIPTION'!S27)","v":0},null,null,null,{"$f":"IF(S27=1,\"\",COUNTIFS($S$7:$S$181,S27))","v":1},19,1,null,6]
[null,null,null,null,null,{"$f":"INDEX('LISTE DES TIREURS'!B$74:B$194,'FEUILLE D''INSCRIPTION'!S28)","v":0},{"$f":"INDEX('LISTE DES TIREURS'!C$74:C$194,'FEUILLE D''INSCRIPTION'!S28)","v":0},{"$f":"INDEX('FEUILLE D''INSCRIPTION'!U$7:U$15,'FEUILLE D''INSCRIPTION'!T28)","v":0},{"$f":"INDEX('LISTE DES TIREURS'!G$8:G$82,'FEUILLE D''INSCRIPTION'!V28)","v":0},{"$f":"INDEX('LISTE DES TIREURS'!F$8:F$82,'FEUILLE D''INSCRIPTION'!V28)","v":0},"","","",{"$f":"INDEX('LISTE DES TIREURS'!D$74:D$194,'FEUILLE D''INSCRIPTION'!S28)","v":0},null,null,null,{"$f":"IF(S28=1,\"\",COUNTIFS($S$7:$S$181,S28))","v":1},25,1,null,6]
[null,null,null,null,null,{"$f":"INDEX('LISTE DES TIREURS'!B$74:B$194,'FEUILLE D''INSCRIPTION'!S29)","v":0},{"$f":"INDEX('LISTE DES TIREURS'!C$74:C$194,'FEUILLE D''INSCRIPTION'!S29)","v":0},{"$f":"INDEX('FEUILLE D''INSCRIPTION'!U$7:U$15,'FEUILLE D''INSCRIPTION'!T29)","v":0},{"$f":"INDEX('LISTE DES TIREURS'!G$8:G$82,'FEUILLE D''INSCRIPTION'!V29)","v":0},{"$f":"INDEX('LISTE DES TIREURS'!F$8:F$82,'FEUILLE D''INSCRIPTION'!V29)","v":0},"","","",{"$f":"INDEX('LISTE DES TIREURS'!D$74:D$194,'FEUILLE D''INSCRIPTION'!S29)","v":0},null,null,null,1,27,1,null,6]
[]
[null,null,null,null,null,{"$f":"INDEX('LISTE DES TIREURS'!B$74:B$194,'FEUILLE D''INSCRIPTION'!S31)","v":0},{"$f":"INDEX('LISTE DES TIREURS'!C$74:C$194,'FEUILLE D''INSCRIPTION'!S31)","v":0},{"$f":"INDEX('FEUILLE D''INSCRIPTION'!U$7:U$15,'FEUILLE D''INSCRIPTION'!T31)","v":0},{"$f":"INDEX('LISTE DES TIREURS'!G$8:G$82,'FEUILLE D''INSCRIPTION'!V31)","v":0},{"$f":"INDEX('LISTE DES TIREURS'!F$8:F$82,'FEUILLE D''INSCRIPTION'!V31)","v":0},"","","",{"$f":"INDEX('LISTE DES TIREURS'!D$74:D$194,'FEUILLE D''INSCRIPTION'!S31)","v":0},null,null,null,{"$f":"IF(S31=1,\"\",COUNTIFS($S$7:$S$181,S31))","v":1},22,1,null,7]
[null,null,null,null,null,{"$f":"INDEX('LISTE DES TIREURS'!B$74:B$194,'FEUILLE D''INSCRIPTION'!S32)","v":0},{"$f":"INDEX('LISTE DES TIREURS'!C$74:C$194,'FEUILLE D''INSCRIPTION'!S32)","v":0},{"$f":"INDEX('FEUILLE D''INSCRIPTION'!U$7:U$15,'FEUILLE D''INSCRIPTION'!T32)","v":0},{"$f":"INDEX('LISTE DES TIREURS'!G$8:G$82,'FEUILLE D''INSCRIPTION'!V32)","v":0},{"$f":"INDEX('LISTE DES TIREURS'!F$8:F$82,'FEUILLE D''INSCRIPTION'!V32)","v":0},"","","",{"$f":"INDEX('LISTE DES TIREURS'!D$74:D$194,'FEUILLE D''INSCRIPTION'!S32)","v":0},null,null,null,"",1,1,null,7]
[null,null,null,null,null,{"$f":"INDEX('LISTE DES TIREURS'!B$74:B$194,'FEUILLE D''INSCRIPTION'!S33)","v":0},{"$f":"INDEX('LISTE DES TIREURS'!C$74:C$194,'FEUILLE D''INSCRIPTION'!S33)","v":0},{"$f":"INDEX('FEUILLE D''INSCRIPTION'!U$7:U$15,'FEUILLE D''INSCRIPTION'!T33)","v":0},{"$f":"INDEX('LISTE DES TIREURS'!G$8:G$82,'FEUILLE D''INSCRIPTION'!V33)","v":0},{"$f":"INDEX('LISTE DES TIREURS'!F$8:F$82,'FEUILLE D''INSCRIPTION'!V33)","v":0},"","","",{"$f":"INDEX('LISTE DES TIREURS'!D$74:D$194,'FEUILLE D''INSCRIPTION'!S33)","v":0},null,null,null,{"$f":"IF(S33=1,\"\",COUNTIFS($S$7:$S$181,S33))","v":1},18,1,null,7]
[null,null,null,null,null,{"$f":"INDEX('LISTE DES TIREURS'!B$74:B$194,'FEUILLE D''INSCRIPTION'!S34)","v":0},{"$f":"INDEX('LISTE DES TIREURS'!C$74:C$194,'FEUILLE D''INSCRIPTION'!S34)","v":0},{"$f":"INDEX('FEUILLE D''INSCRIPTION'!U$7:U$15,'FEUILLE D''INSCRIPTION'!T34)","v":0},{"$f":"INDEX('LISTE DES TIREURS'!G$8:G$82,'FEUILLE D''INSCRIPTION'!V34)","v":0},{"$f":"INDEX('LISTE DES TIREURS'!F$8:F$82,'FEUILLE D''INSCRIPTION'!V34)","v":0},"","","",{"$f":"INDEX('LISTE DES TIREURS'!D$74:D$194,'FEUILLE D''INSCRIPTION'!S34)","v":0},null,null,null,{"$f":"IF(S34=1,\"\",COUNTIFS($S$7:$S$181,S34))","v":1},16,1,null,7]
[null,null,null,null,null,{"$f":"INDEX('LISTE DES TIREURS'!B$74:B$194,'FEUILLE D''INSCRIPTION'!S35)","v":0},{"$f":"INDEX('LISTE DES TIREURS'!C$74:C$194,'FEUILLE D''INSCRIPTION'!S35)","v":0},{"$f":"INDEX('FEUILLE D''INSCRIPTION'!U$7:U$15,'FEUILLE D''INSCRIPTION'!T35)","v":0},{"$f":"INDEX('LISTE DES TIREURS'!G$8:G$82,'FEUILLE D''INSCRIPTION'!V35)","v":0},{"$f":"INDEX('LISTE DES TIREURS'!F$8:F$82,'FEUILLE D''INSCRIPTION'!V35)","v":0},"","","",{"$f":"INDEX('LISTE DES TIREURS'!D$74:D$194,'FEUILLE D''INSCRIPTION'!S35)","v":0},null,null,null,1,17,1,null,7]
[]
[null,null,null,null,null,{"$f":"INDEX('LISTE DES TIREURS'!B$74:B$194,'FEUILLE D''INSCRIPTION'!S37)","v":0},{"$f":"INDEX('LISTE DES TIREURS'!C$74:C$194,'FEUILLE D''INSCRIPTION'!S37)","v":0},{"$f":"INDEX('FEUILLE D''INSCRIPTION'!U$7:U$15,'FEUILLE D''INSCRIPTION'!T37)","v":0},{"$f":"INDEX('LISTE DES TIREURS'!G$8:G$82,'FEUILLE D''INSCRIPTION'!V37)","v":0},{"$f":"INDEX('LISTE DES TIREURS'!F$8:F$82,'FEUILLE D''INSCRIPTION'!V37)","v":0},"","","",{"$f":"INDEX('LISTE DES TIREURS'!D$74:D$194,'FEUILLE D''INSCRIPTION'!S37)","v":0},null,null,null,{"$f":"IF(S37=1,\"\",COUNTIFS($S$7:$S$181,S37))","v":""},1,1,null,1]
[null,null,null,null,null,{"$f":"INDEX('LISTE DES TIREURS'!B$74:B$194,'FEUILLE D''INSCRIPTION'!S38)","v":0},{"$f":"INDEX('LISTE DES TIREURS'!C$74:C$194,'FEUILLE D''INSCRIPTION'!S38)","v":0},{"$f":"INDEX('FEUILLE D''INSCRIPTION'!U$7:U$15,'FEUILLE D''INSCRIPTION'!T38)","v":0},{"$f":"INDEX('LISTE DES TIREURS'!G$8:G$82,'FEUILLE D''INSCRIPTION'!V38)","v":0},{"$f":"INDEX('LISTE DES TIREURS'!F$8:F$82,'FEUILLE D''INSCRIPTION'!V38)","v":0},"","","",{"$f":"INDEX('LISTE DES TIREURS'!D$74:D$194,'FEUILLE D''INSCRIPTION'!S38)","v":0},null,null,null,"",1,1,null,1]
[null,null,null,null,null,{"$f":"INDEX('LISTE DES TIREURS'!B$74:B$194,'FEUILLE D''INSCRIPTION'!S39)","v":0},{"$f":"INDEX('LISTE DES TIREURS'!C$74:C$194,'FEUILLE D''INSCRIPTION'!S39)","v":0},{"$f":"INDEX('FEUILLE D''INSCRIPTION'!U$7:U$15,'FEUILLE D''INSCRIPTION'!T39)","v":0},{"$f":"INDEX('LISTE DES TIREURS'!G$8:G$82,'FEUILLE D''INSCRIPTION'!V39)","v":0},{"$f":"INDEX('LISTE DES TIREURS'!F$8:F$82,'FEUILLE D''INSCRIPTION'!V39)","v":0},"","","",{"$f":"INDEX('LISTE DES TIREURS'!D$74:D$194,'FEUILLE D''INSCRIPTION'!S39)","v":0},null,null,null,{"$f":"IF(S39=1,\"\",COUNTIFS($S$7:$S$181,S39))","v":1},32,1,null,1]
[null,null,null,null,null,{"$f":"INDEX('LISTE DES TIREURS'!B$74:B$194,'FEUILLE D''INSCRIPTION'!S40)","v":0},{"$f":"INDEX('LISTE DES TIREURS'!C$74:C$194,'FEUILLE D''INSCRIPTION'!S40)","v":0},{"$f":"INDEX('FEUILLE D''INSCRIPTION'!U$7:U$15,'FEUILLE D''INSCRIPTION'!T40)","v":0},{"$f":"INDEX('LISTE DES TIREURS'!G$8:G$82,'FEUILLE D''INSCRIPTION'!V40)","v":0},{"$f":"INDEX('LISTE DES TIREURS'!F$8:F$82,'FEUILLE D''INSCRIPTION'!V40)","v":0},"","","",{"$f":"INDEX('LISTE DES TIREURS'!D$74:D$194,'FEUILLE D''INSCRIPTION'!S40)","v":0},null,null,null,{"$f":"IF(S40=1,\"\",COUNTIFS($S$7:$S$181,S40))","v":1},33,1,null,1]
{"$rows_left_out":996}
{"sheet":"MODE D'EMPLOI","index":2,"n_rows":0,"n_cols":0,"rows_kept":0,"cut":false,"hidden":false,"merged":[]}